BDBM50235040 AMINOPURVALANOL::CHEBI:38937
SMILES CC(C)[C@H](CO)Nc1nc(Nc2cc(N)cc(Cl)c2)c2ncn(C(C)C)c2n1
InChI Key InChIKey=RAMROQQYRRQPDL-HNNXBMFYSA-N
Data  1 IC50  1 EC50
  Tab Delimited (TSV)   2D SDfile   Computed 3D by Vconf -m prep SDfile
Find this compound or compounds like it in BindingDB:
Activity Spreadsheet -- Enzyme Inhibition Constant Data from BindingDB
Found 2 hits for monomerid = 50235040
LigandPNGBDBM50235040(AMINOPURVALANOL | CHEBI:38937)
Affinity DataIC50: <50nM. Assay description: Inhibition of human CDK2/cyclinA using histone H1 as substrate incubated for 30 mins in presence of gamma[32P]ATP by phosphoimaging analysis
In DepthDetails PubMed
TargetDual specificity protein kinase CLK1(Homo sapiens (Human))
Sri International
Curated by ChEMBL
LigandPNGBDBM50235040(AMINOPURVALANOL | CHEBI:38937)
Affinity DataEC50:  1.20E+4nM. Assay description: Inhibition of CLK mediated SF3B1 activation in human SK-MEL-2 cells assessed as MDM2-pre mRNA exon skipping after 4 hrs by luciferase reporter gene a...
In DepthDetails ArticlePubMed